{"text_format":"1","workbook":"xlsx","n_sheets":15,"sheets":["Exe Sum","MEMO","Industry","MCD","YOY MCD","CAVA","YOY CAVA","CMG","YOY CMG","SHAK","YOY SHAK","YUM","YOY Yum","Ratio Formulas","TrendLineChart"],"not_rendered":{"charts":12,"images":2,"macros":0,"external_links":1,"defined_names":18,"comments":0,"pivot_tables":0},"unopened":[],"bounds":{"document_bytes":16777216,"sheet_cells":100000,"rows_first":2000,"rows_last":500,"rows_between":2000,"halvings":0,"cell_chars":16384,"cell_head_chars":4096},"cells_cut":0,"cells_raw":0,"read":"whole","date_system":"1900"}

{"sheet":"Exe Sum","index":0,"n_rows":13,"n_cols":16,"rows_kept":13,"cut":false,"hidden":false,"merged":[]}
[]
[]
[]
[]
[]
[]
[]
[null,null,null,null,null,null,null,null,null,null,null,null,null,"STOCK NAME","TICKER","MARKET PRICE (12/31/2024)"]
[null,null,null,null,null,null,null,null,null,null,null,null,null,"McDonald's Corporation","(MCD)",305.63]
[null,null,null,null,null,null,null,null,null,null,null,null,null,"CAVA Group, Inc.","(CAVA)",58.69]
{"$rows_left_out":4}
{"sheet":"MEMO","index":1,"n_rows":0,"n_cols":0,"rows_kept":0,"cut":false,"hidden":false,"merged":[]}

{"sheet":"Industry","index":2,"n_rows":44,"n_cols":8,"rows_kept":44,"cut":false,"hidden":false,"merged":[]}
["Company Name",null,"MCD","CAVA","CMG","SHAK","YUM","Industry"]
["*Numbers in Thousands",null,1,2,3,4,5,"Average"]
["Stock Price, Market Price of Common Stock ",null,289.89,170.25,68.55,144.65,137.77000000000001,{"$f":"AVERAGE(C3:G3)","v":162.22199999999998}]
["Revenue",null,{"$f":"_xlfn.XLOOKUP(A4,MCD!$A$2:$A$69,MCD!$B$2:$B$69,\"Find it\")","v":25920},963.71,11313.85,1252.6099999999999,7549,{"$f":"AVERAGE(C4:G4)","v":9399.8339999999989}]
["Cost of Revenue",null,{"$f":"_xlfn.XLOOKUP(A5,MCD!$A$2:$A$69,MCD!$B$2:$B$69,\"Find it\")","v":11210},532.23,8296.16,950.14,2120,4621.7060000000001]
["Gross Profit",null,{"$f":"_xlfn.XLOOKUP(A6,MCD!$A$2:$A$69,MCD!$B$2:$B$69,\"Find it\")","v":14710},431.48,3017.69,302.47000000000003,5429,4778.1279999999997]
["SG&A Expenses",null,{"$f":"_xlfn.XLOOKUP(A7,MCD!$A$2:$A$69,MCD!$B$2:$B$69,\"Find it\")","v":2412},120.5,697.48,149.05000000000001,2892,1254.2060000000001]
["Operating Income",null,{"$f":"_xlfn.XLOOKUP(A8,MCD!$A$2:$A$69,MCD!$B$2:$B$69,\"Find it\")","v":11712},43.12,1916.33,3.04,2403,3215.4980000000005]
["Net Income Common",null,{"$f":"_xlfn.XLOOKUP(A9,MCD!$A$2:$A$69,MCD!$B$2:$B$69,\"Find it\")","v":8223},130.32,1534.11,10.210000000000001,1486,2276.7280000000001]
["Cash and Short Term Investments",null,{"$f":"_xlfn.XLOOKUP(A10,MCD!$A$2:$A$69,MCD!$B$2:$B$69,\"Find it\")","v":1085},385.78,1422.91,320.70999999999998,616,766.08]
{"$rows_left_out":35}
{"sheet":"MCD","index":3,"n_rows":69,"n_cols":5,"rows_kept":69,"cut":false,"hidden":false,"merged":[]}
["Statements","2024","2023","2022","2021"]
["Revenue",25920,25494,23183,23222.9]
["Revenue Growth",1.67E-2,9.9699999999999997E-2,-1.6999999999999999E-3,0.20899999999999999]
["Cost of Revenue",11210,10931,9975,10642.7]
["Gross Profit",14710,14563,13208,12580.2]
["SG&A Expenses",2412,2435,2492,2707.5]
["Operating Income",11712,11647,9372,10356]
["Interest Expense (Operating)",100,100,1299,1194]
["Non-operating Income/Expense",-1367,-1125,-1546,-1228.0999999999999]
["Non-operating Interest Expenses",1506,1361,1207,1185.8]
{"$rows_left_out":60}
{"sheet":"YOY MCD","index":4,"n_rows":44,"n_cols":10,"rows_kept":44,"cut":false,"hidden":false,"merged":[[0,4,1,4],[0,6,1,6],[0,8,1,8],[19,4,20,4],[19,6,20,6],[19,8,20,8]]}
[{"$f":"+H48+A1:J44+A1:A1:J45","v":0},null,"MCD","MCD","% Change YOY","MCD","% Change YOY","MCD","% Change YOY","MCD"]
["Year ending:",null,2024,2023,null,2023,null,2022,null,2021]
["Stock Price ",null,289.89,296.51,{"$f":"IFERROR((C3-D3)/D3,\"Missing Info\")","v":-2.2326397086101665E-2},296.51,{"$f":"IFERROR((F3-H3)/H3,\"Missing Info\")","v":0.12514704208249544},263.52999999999997,{"$f":"IFERROR((H3-J3)/J3,\"Missing Info\")","v":-1.6935874958033427E-2},268.07]
["Revenue",null,{"$f":"_xlfn.XLOOKUP(A4,MCD!$A$2:$A$69,MCD!$B$2:$B$69,\"Find it\")","v":25920},{"$f":"_xlfn.XLOOKUP(A4,MCD!$A$2:$A$69,MCD!$C$2:$C$69,\"Find it\")","v":25494},{"$f":"IFERROR((C4-D4)/D4,\"Missing Info\")","v":1.670981407389974E-2},{"$f":"D4","v":25494},{"$f":"IFERROR((F4-H4)/H4,\"Missing Info\")","v":9.9685114092222749E-2},{"$f":"_xlfn.XLOOKUP(A4,MCD!$A$2:$A$69,MCD!$D$2:$D$69,\"Find it\")","v":23183},{"$f":"IFERROR((H4-J4)/J4,\"Missing Info\")","v":-1.7181316717550974E-3},{"$f":"_xlfn.XLOOKUP(A4,MCD!$A$2:$A$69,MCD!$E$2:$E$69,\"Find it\")","v":23222.9}]
["Cost of Revenue",null,{"$f":"_xlfn.XLOOKUP(A5,MCD!$A$2:$A$69,MCD!$B$2:$B$69,\"Find it\")","v":11210},{"$f":"_xlfn.XLOOKUP(A5,MCD!$A$2:$A$69,MCD!$C$2:$C$69,\"Find it\")","v":10931},{"$f":"IFERROR((C5-D5)/D5,\"Missing Info\")","v":2.5523739822523098E-2},{"$f":"D5","v":10931},{"$f":"IFERROR((F5-H5)/H5,\"Missing Info\")","v":9.5839598997493738E-2},{"$f":"_xlfn.XLOOKUP(A5,MCD!$A$2:$A$69,MCD!$D$2:$D$69,\"Find it\")","v":9975},{"$f":"IFERROR((H5-J5)/J5,\"Missing Info\")","v":-6.2737839082187857E-2},{"$f":"_xlfn.XLOOKUP(A5,MCD!$A$2:$A$69,MCD!$E$2:$E$69,\"Find it\")","v":10642.7}]
["Gross Profit",null,{"$f":"_xlfn.XLOOKUP(A6,MCD!$A$2:$A$69,MCD!$B$2:$B$69,\"Find it\")","v":14710},{"$f":"_xlfn.XLOOKUP(A6,MCD!$A$2:$A$69,MCD!$C$2:$C$69,\"Find it\")","v":14563},1.0094074023209504E-2,14563,0.1025893397940642,{"$f":"_xlfn.XLOOKUP(A6,MCD!$A$2:$A$69,MCD!$D$2:$D$69,\"Find it\")","v":13208},4.990381710942586E-2,{"$f":"_xlfn.XLOOKUP(A6,MCD!$A$2:$A$69,MCD!$E$2:$E$69,\"Find it\")","v":12580.2}]
["SG&A Expenses",null,{"$f":"_xlfn.XLOOKUP(A7,MCD!$A$2:$A$69,MCD!$B$2:$B$69,\"Find it\")","v":2412},{"$f":"_xlfn.XLOOKUP(A7,MCD!$A$2:$A$69,MCD!$C$2:$C$69,\"Find it\")","v":2435},-9.4455852156057497E-3,2435,-2.2873194221508828E-2,{"$f":"_xlfn.XLOOKUP(A7,MCD!$A$2:$A$69,MCD!$D$2:$D$69,\"Find it\")","v":2492},-7.9593721144967683E-2,{"$f":"_xlfn.XLOOKUP(A7,MCD!$A$2:$A$69,MCD!$E$2:$E$69,\"Find it\")","v":2707.5}]
["Operating Income",null,{"$f":"_xlfn.XLOOKUP(A8,MCD!$A$2:$A$69,MCD!$B$2:$B$69,\"Find it\")","v":11712},{"$f":"_xlfn.XLOOKUP(A8,MCD!$A$2:$A$69,MCD!$C$2:$C$69,\"Find it\")","v":11647},5.5808362668498326E-3,11647,0.2427443448570209,{"$f":"_xlfn.XLOOKUP(A8,MCD!$A$2:$A$69,MCD!$D$2:$D$69,\"Find it\")","v":9372},-9.5017381228273468E-2,{"$f":"_xlfn.XLOOKUP(A8,MCD!$A$2:$A$69,MCD!$E$2:$E$69,\"Find it\")","v":10356}]
["Net Income Common",null,{"$f":"_xlfn.XLOOKUP(A9,MCD!$A$2:$A$69,MCD!$B$2:$B$69,\"Find it\")","v":8223},{"$f":"_xlfn.XLOOKUP(A9,MCD!$A$2:$A$69,MCD!$C$2:$C$69,\"Find it\")","v":8469},-2.9047113000354233E-2,8469,0.37105390966488588,{"$f":"_xlfn.XLOOKUP(A9,MCD!$A$2:$A$69,MCD!$D$2:$D$69,\"Find it\")","v":6177},-0.1813338281291417,{"$f":"_xlfn.XLOOKUP(A9,MCD!$A$2:$A$69,MCD!$E$2:$E$69,\"Find it\")","v":7545.2}]
["Cash and Short Term Investments",null,{"$f":"_xlfn.XLOOKUP(A10,MCD!$A$2:$A$69,MCD!$B$2:$B$69,\"Find it\")","v":1085},{"$f":"_xlfn.XLOOKUP(A10,MCD!$A$2:$A$69,MCD!$C$2:$C$69,\"Find it\")","v":4579},-0.76304870058964835,4579,0.7721959904017337,{"$f":"_xlfn.XLOOKUP(A10,MCD!$A$2:$A$69,MCD!$D$2:$D$69,\"Find it\")","v":2583.8000000000002},-0.45132931283445166,{"$f":"_xlfn.XLOOKUP(A10,MCD!$A$2:$A$69,MCD!$E$2:$E$69,\"Find it\")","v":4709.2}]
{"$rows_left_out":35}
{"sheet":"CAVA","index":5,"n_rows":74,"n_cols":5,"rows_kept":74,"cut":false,"hidden":false,"merged":[]}
["Statements","2024","2023","2022","2021"]
["Revenue",963.71,728.7,564.12,500.07]
["Revenue Growth",0.32250000000000001,0.29170000000000001,0.12809999999999999,100]
["Cost of Revenue",532.23,400.78,337.88,298.17]
["Gross Profit",431.48,327.92,226.24,201.91]
["SG&A Expenses",120.5,101.49,70.040000000000006,64.790000000000006]
["Operating Income",43.12,4.72,-59.77,-52.75]
["Interest Expense (Operating)",100,100,0.05,4.8099999999999996]
["Non-operating Income/Expense",16.79,9.32,0.87,15.48]
["Non-operating Interest Expenses",-16.47,-8.85,0.05,4.8099999999999996]
{"$rows_left_out":65}
{"sheet":"YOY CAVA","index":6,"n_rows":44,"n_cols":10,"rows_kept":44,"cut":false,"hidden":false,"merged":[[0,4,1,4],[0,6,1,6],[0,8,1,8],[19,4,20,4],[19,6,20,6],[19,8,20,8]]}
[{"$f":"+H48+A1:J44+A1:A1:J45","v":0},null,"CAVA","CAVA","% Change YOY","CAVA","% Change YOY","CAVA","% Change YOY","CAVA"]
["Year ending:",null,2024,2023,null,2023,null,2022,null,2021]
["Stock Price ",null,170.25,101.5,{"$f":"IFERROR((C3-D3)/D3,\"Missing Info\")","v":0.67733990147783252},101.5,{"$f":"IFERROR((F3-H3)/H3,\"Missing Info\")","v":0},101.5,{"$f":"IFERROR((H3-J3)/J3,\"Missing Info\")","v":0},101.5]
["Revenue",null,{"$f":"_xlfn.XLOOKUP(A4,Table2[Statements],Table2[2024])","v":963.71},{"$f":"_xlfn.XLOOKUP(A4,Table2[Statements],Table2[2023])","v":728.7},{"$f":"IFERROR((C4-D4)/D4,\"Missing Info\")","v":0.32250583230410318},{"$f":"D4","v":728.7},{"$f":"IFERROR((F4-H4)/H4,\"Missing Info\")","v":0.2917464369283132},{"$f":"_xlfn.XLOOKUP(A4,Table2[Statements],Table2[2022])","v":564.12},{"$f":"IFERROR((H4-J4)/J4,\"Missing Info\")","v":0.12808206851040857},{"$f":"_xlfn.XLOOKUP(A4,Table2[Statements],Table2[2021])","v":500.07}]
["Cost of Revenue",null,{"$f":"_xlfn.XLOOKUP(A5,Table2[Statements],Table2[2024])","v":532.23},{"$f":"_xlfn.XLOOKUP(A5,Table2[Statements],Table2[2023])","v":400.78},{"$f":"IFERROR((C5-D5)/D5,\"Missing Info\")","v":0.32798542841459166},{"$f":"D5","v":400.78},{"$f":"IFERROR((F5-H5)/H5,\"Missing Info\")","v":0.18616076713626134},{"$f":"_xlfn.XLOOKUP(A5,Table2[Statements],Table2[2022])","v":337.88},{"$f":"IFERROR((H5-J5)/J5,\"Missing Info\")","v":0.1331790589261159},{"$f":"_xlfn.XLOOKUP(A5,Table2[Statements],Table2[2021])","v":298.17}]
["Gross Profit",null,{"$f":"_xlfn.XLOOKUP(A6,Table2[Statements],Table2[2024])","v":431.48},{"$f":"_xlfn.XLOOKUP(A6,Table2[Statements],Table2[2023])","v":327.92},0.31580873383752134,327.92,0.44943422913719944,{"$f":"_xlfn.XLOOKUP(A6,Table2[Statements],Table2[2022])","v":226.24},0.12049923233123676,{"$f":"_xlfn.XLOOKUP(A6,Table2[Statements],Table2[2021])","v":201.91}]
["SG&A Expenses",null,{"$f":"_xlfn.XLOOKUP(A7,Table2[Statements],Table2[2024])","v":120.5},{"$f":"_xlfn.XLOOKUP(A7,Table2[Statements],Table2[2023])","v":101.49},0.18730909449206826,101.49,0.44902912621359203,{"$f":"_xlfn.XLOOKUP(A7,Table2[Statements],Table2[2022])","v":70.040000000000006},8.103102330606575E-2,{"$f":"_xlfn.XLOOKUP(A7,Table2[Statements],Table2[2021])","v":64.790000000000006}]
["Operating Income",null,{"$f":"_xlfn.XLOOKUP(A8,Table2[Statements],Table2[2024])","v":43.12},{"$f":"_xlfn.XLOOKUP(A8,Table2[Statements],Table2[2023])","v":4.72},8.1355932203389827,4.72,-1.0789693826334283,{"$f":"_xlfn.XLOOKUP(A8,Table2[Statements],Table2[2022])","v":-59.77},0.13308056872037921,{"$f":"_xlfn.XLOOKUP(A8,Table2[Statements],Table2[2021])","v":-52.75}]
["Net Income Common",null,{"$f":"_xlfn.XLOOKUP(A9,Table2[Statements],Table2[2024])","v":130.32},{"$f":"_xlfn.XLOOKUP(A9,Table2[Statements],Table2[2023])","v":13.28},8.8132530120481931,13.28,-1.2251229021868113,{"$f":"_xlfn.XLOOKUP(A9,Table2[Statements],Table2[2022])","v":-58.99},0.57769457074083985,{"$f":"_xlfn.XLOOKUP(A9,Table2[Statements],Table2[2021])","v":-37.39}]
["Cash and Short Term Investments",null,{"$f":"_xlfn.XLOOKUP(A10,Table2[Statements],Table2[2024])","v":385.78},{"$f":"_xlfn.XLOOKUP(A10,Table2[Statements],Table2[2023])","v":369.27},4.4709832913586239E-2,369.27,8.6037364798426125E-3,{"$f":"_xlfn.XLOOKUP(A10,Table2[Statements],Table2[2022])","v":366.12},-2.8325525656390138E-3,{"$f":"_xlfn.XLOOKUP(A10,Table2[Statements],Table2[2021])","v":367.16}]
{"$rows_left_out":35}
{"sheet":"CMG","index":7,"n_rows":68,"n_cols":5,"rows_kept":68,"cut":false,"hidden":false,"merged":[]}
["Statements","2024","2023","2022","2021"]
["Revenue",11313.85,9871.65,8634.65,7547.06]
["Revenue Growth",0.14610000000000001,0.14330000000000001,0.14410000000000001,0.2611]
["Cost of Revenue",8296.16,7285.56,6572.53,5840.05]
["Gross Profit",3017.69,2586.09,2062.12,1707.01]
["SG&A Expenses",697.48,633.58000000000004,564.19000000000005,606.85]
["Operating Income",1916.33,1557.81,1160.4000000000001,804.94]
["Non-operating Income/Expense",93.9,62.69,21.13,7.82]
["Non-operating Interest Expenses",100,100,100,100]
["EBT",2010.23,1620.51,1181.53,812.76]
{"$rows_left_out":59}
{"sheet":"YOY CMG","index":8,"n_rows":44,"n_cols":10,"rows_kept":44,"cut":false,"hidden":false,"merged":[[0,4,1,4],[0,6,1,6],[0,8,1,8],[19,4,20,4],[19,6,20,6],[19,8,20,8]]}
[{"$f":"+H48+A1:J44+A1:A1:J45","v":0},null,"CMG","CMG","% Change YOY","CMG","% Change YOY","CMG","% Change YOY","CMG"]
["Year ending:",null,2024,2023,null,2023,null,2022,null,2021]
["Stock Price ",null,68.55,46.8,{"$f":"IFERROR((C3-D3)/D3,\"Missing Info\")","v":0.46474358974358976},46.8,{"$f":"IFERROR((F3-H3)/H3,\"Missing Info\")","v":0.33371330863493853},35.090000000000003,{"$f":"IFERROR((H3-J3)/J3,\"Missing Info\")","v":-0.10416134797038545},39.17]
["Revenue",null,{"$f":"_xlfn.XLOOKUP(A4,Table3[Statements],Table3[2024])","v":11313.85},{"$f":"_xlfn.XLOOKUP(A4,Table3[Statements],Table3[2023])","v":9871.65},{"$f":"IFERROR((C4-D4)/D4,\"Missing Info\")","v":0.14609513100646809},{"$f":"D4","v":9871.65},{"$f":"IFERROR((F4-H4)/H4,\"Missing Info\")","v":0.1432600047483106},{"$f":"_xlfn.XLOOKUP(A4,Table3[Statements],Table3[2022])","v":8634.65},{"$f":"IFERROR((H4-J4)/J4,\"Missing Info\")","v":0.14410777176807912},{"$f":"_xlfn.XLOOKUP(A4,Table3[Statements],Table3[2021])","v":7547.06}]
["Cost of Revenue",null,{"$f":"_xlfn.XLOOKUP(A5,Table3[Statements],Table3[2024])","v":8296.16},{"$f":"_xlfn.XLOOKUP(A5,Table3[Statements],Table3[2023])","v":7285.56},{"$f":"IFERROR((C5-D5)/D5,\"Missing Info\")","v":0.13871274136785633},{"$f":"D5","v":7285.56},{"$f":"IFERROR((F5-H5)/H5,\"Missing Info\")","v":0.10848638195641568},{"$f":"_xlfn.XLOOKUP(A5,Table3[Statements],Table3[2022])","v":6572.53},{"$f":"IFERROR((H5-J5)/J5,\"Missing Info\")","v":0.12542358370219425},{"$f":"_xlfn.XLOOKUP(A5,Table3[Statements],Table3[2021])","v":5840.05}]
["Gross Profit",null,{"$f":"_xlfn.XLOOKUP(A6,Table3[Statements],Table3[2024])","v":3017.69},{"$f":"_xlfn.XLOOKUP(A6,Table3[Statements],Table3[2023])","v":2586.09},0.16689287689136878,2586.09,0.25409287529338753,{"$f":"_xlfn.XLOOKUP(A6,Table3[Statements],Table3[2022])","v":2062.12},0.20803041575620523,{"$f":"_xlfn.XLOOKUP(A6,Table3[Statements],Table3[2021])","v":1707.01}]
["SG&A Expenses",null,{"$f":"_xlfn.XLOOKUP(A7,Table3[Statements],Table3[2024])","v":697.48},{"$f":"_xlfn.XLOOKUP(A7,Table3[Statements],Table3[2023])","v":633.58000000000004},0.1008554562959689,633.58000000000004,0.1229904819298463,{"$f":"_xlfn.XLOOKUP(A7,Table3[Statements],Table3[2022])","v":564.19000000000005},-7.0297437587542172E-2,{"$f":"_xlfn.XLOOKUP(A7,Table3[Statements],Table3[2021])","v":606.85}]
["Operating Income",null,{"$f":"_xlfn.XLOOKUP(A8,Table3[Statements],Table3[2024])","v":1916.33},{"$f":"_xlfn.XLOOKUP(A8,Table3[Statements],Table3[2023])","v":1557.81},0.23014359902683895,1557.81,0.34247673216132352,{"$f":"_xlfn.XLOOKUP(A8,Table3[Statements],Table3[2022])","v":1160.4000000000001},0.4415981315377544,{"$f":"_xlfn.XLOOKUP(A8,Table3[Statements],Table3[2021])","v":804.94}]
["Net Income Common",null,{"$f":"_xlfn.XLOOKUP(A9,Table3[Statements],Table3[2024])","v":1534.11},{"$f":"_xlfn.XLOOKUP(A9,Table3[Statements],Table3[2023])","v":1228.74},0.24852287709360799,1228.74,0.3666332999666333,{"$f":"_xlfn.XLOOKUP(A9,Table3[Statements],Table3[2022])","v":899.1},0.37691812919231832,{"$f":"_xlfn.XLOOKUP(A9,Table3[Statements],Table3[2021])","v":652.98}]
["Cash and Short Term Investments",null,{"$f":"_xlfn.XLOOKUP(A10,Table3[Statements],Table3[2024])","v":1422.91},{"$f":"_xlfn.XLOOKUP(A10,Table3[Statements],Table3[2023])","v":1295.45},9.8390520668493603E-2,1295.45,0.4407656204817938,{"$f":"_xlfn.XLOOKUP(A10,Table3[Statements],Table3[2022])","v":899.14},-0.16461647093801096,{"$f":"_xlfn.XLOOKUP(A10,Table3[Statements],Table3[2021])","v":1076.32}]
{"$rows_left_out":35}
{"sheet":"SHAK","index":9,"n_rows":70,"n_cols":5,"rows_kept":70,"cut":false,"hidden":false,"merged":[]}
["Statements","2024","2023","2022","2021"]
["Revenue",1252.6099999999999,1087.53,900.49,739.89]
["Revenue Growth",0.15179999999999999,0.2077,0.217,0.41510000000000002]
["Cost of Revenue",950.14,838.59,717.1,594.64]
["Gross Profit",302.47000000000003,248.94,183.39,145.26]
["SG&A Expenses",149.05000000000001,129.54,120.01,87.2]
["Operating Income",3.04,5.92,-26.89,-15.85]
["Interest Expense (Operating)",100,100,1.52,1.58]
["Non-operating Income/Expense",11.21,11.06,2.61,-1.48]
["Non-operating Interest Expenses",2.04,1.72,1.52,1.58]
{"$rows_left_out":61}
{"sheet":"YOY SHAK","index":10,"n_rows":44,"n_cols":10,"rows_kept":44,"cut":false,"hidden":false,"merged":[[0,4,1,4],[0,6,1,6],[0,8,1,8],[19,4,20,4],[19,6,20,6],[19,8,20,8]]}
[{"$f":"+H48+A1:J44+A1:A1:J45","v":0},null,"MCD","MCD","% Change YOY","MCD","% Change YOY","MCD","% Change YOY","MCD"]
["Year ending:",null,2024,2023,null,2023,null,2022,null,2021]
["Stock Price ",null,144.65,102,{"$f":"IFERROR((C3-D3)/D3,\"Missing Info\")","v":0.41813725490196085},102,{"$f":"IFERROR((F3-H3)/H3,\"Missing Info\")","v":0.02},100,{"$f":"IFERROR((H3-J3)/J3,\"Missing Info\")","v":-0.16826083340264497},120.23]
["Revenue",null,{"$f":"_xlfn.XLOOKUP(A4,Table4[Statements],Table4[2024])","v":1252.6099999999999},{"$f":"_xlfn.XLOOKUP(A4,Table4[Statements],Table4[2023])","v":1087.53},{"$f":"IFERROR((C4-D4)/D4,\"Missing Info\")","v":0.15179351374214958},{"$f":"D4","v":1087.53},{"$f":"IFERROR((F4-H4)/H4,\"Missing Info\")","v":0.20770913613699205},{"$f":"_xlfn.XLOOKUP(A4,Table4[Statements],Table4[2022])","v":900.49},{"$f":"IFERROR((H4-J4)/J4,\"Missing Info\")","v":0.21705929259754833},{"$f":"_xlfn.XLOOKUP(A4,Table4[Statements],Table4[2021])","v":739.89}]
["Cost of Revenue",null,{"$f":"_xlfn.XLOOKUP(A5,Table4[Statements],Table4[2024])","v":950.14},{"$f":"_xlfn.XLOOKUP(A5,Table4[Statements],Table4[2023])","v":838.59},{"$f":"IFERROR((C5-D5)/D5,\"Missing Info\")","v":0.13302090413670561},{"$f":"D5","v":838.59},{"$f":"IFERROR((F5-H5)/H5,\"Missing Info\")","v":0.16941849114488913},{"$f":"_xlfn.XLOOKUP(A5,Table4[Statements],Table4[2022])","v":717.1},{"$f":"IFERROR((H5-J5)/J5,\"Missing Info\")","v":0.20593972823893456},{"$f":"_xlfn.XLOOKUP(A5,Table4[Statements],Table4[2021])","v":594.64}]
["Gross Profit",null,{"$f":"_xlfn.XLOOKUP(A6,Table4[Statements],Table4[2024])","v":302.47000000000003},{"$f":"_xlfn.XLOOKUP(A6,Table4[Statements],Table4[2023])","v":248.94},0.21503173455451124,248.94,0.35743497464420099,{"$f":"_xlfn.XLOOKUP(A6,Table4[Statements],Table4[2022])","v":183.39},0.26249483684427921,{"$f":"_xlfn.XLOOKUP(A6,Table4[Statements],Table4[2021])","v":145.26}]
["SG&A Expenses",null,{"$f":"_xlfn.XLOOKUP(A7,Table4[Statements],Table4[2024])","v":149.05000000000001},{"$f":"_xlfn.XLOOKUP(A7,Table4[Statements],Table4[2023])","v":129.54},0.15060985023930848,129.54,7.9410049162569676E-2,{"$f":"_xlfn.XLOOKUP(A7,Table4[Statements],Table4[2022])","v":120.01},0.37626146788990827,{"$f":"_xlfn.XLOOKUP(A7,Table4[Statements],Table4[2021])","v":87.2}]
["Operating Income",null,{"$f":"_xlfn.XLOOKUP(A8,Table4[Statements],Table4[2024])","v":3.04},{"$f":"_xlfn.XLOOKUP(A8,Table4[Statements],Table4[2023])","v":5.92},-0.48648648648648646,5.92,-1.2201561918928971,{"$f":"_xlfn.XLOOKUP(A8,Table4[Statements],Table4[2022])","v":-26.89},0.69652996845425874,{"$f":"_xlfn.XLOOKUP(A8,Table4[Statements],Table4[2021])","v":-15.85}]
["Net Income Common",null,{"$f":"_xlfn.XLOOKUP(A9,Table4[Statements],Table4[2024])","v":10.210000000000001},{"$f":"_xlfn.XLOOKUP(A9,Table4[Statements],Table4[2023])","v":20.260000000000002},-0.49605133267522211,20.260000000000002,-1.9543099387658973,{"$f":"_xlfn.XLOOKUP(A9,Table4[Statements],Table4[2022])","v":-21.23},3.6557017543859658,{"$f":"_xlfn.XLOOKUP(A9,Table4[Statements],Table4[2021])","v":-4.5599999999999996}]
["Cash and Short Term Investments",null,{"$f":"_xlfn.XLOOKUP(A10,Table4[Statements],Table4[2024])","v":320.70999999999998},{"$f":"_xlfn.XLOOKUP(A10,Table4[Statements],Table4[2023])","v":293.20999999999998},9.3789434193922452E-2,293.20999999999998,-5.7899302766442944E-2,{"$f":"_xlfn.XLOOKUP(A10,Table4[Statements],Table4[2022])","v":311.23},-0.18613529980910543,{"$f":"_xlfn.XLOOKUP(A10,Table4[Statements],Table4[2021])","v":382.41}]
{"$rows_left_out":35}
{"sheet":"YUM","index":11,"n_rows":70,"n_cols":5,"rows_kept":70,"cut":false,"hidden":false,"merged":[]}
["Statements","2024","2023","2022","2021"]
["Revenue",7549,7076,6842,6584]
["Revenue Growth",6.6799999999999998E-2,3.4200000000000001E-2,3.9199999999999999E-2,0.16489999999999999]
["Cost of Revenue",2120,1774,1745,1725]
["Gross Profit",5429,5302,5097,4859]
["R&D Expenses",100,100,100,100]
["SG&A Expenses",2892,2876,2807,2636]
["Operating Income",2403,2318,2187,2139]
["Interest Expense (Operating)",100,100,537,522]
["Non-operating Income/Expense",-503,-500,-525,-465]
{"$rows_left_out":61}
{"sheet":"YOY Yum","index":12,"n_rows":44,"n_cols":10,"rows_kept":44,"cut":false,"hidden":false,"merged":[[0,4,1,4],[0,6,1,6],[0,8,1,8],[19,4,20,4],[19,6,20,6],[19,8,20,8]]}
[{"$f":"+H48+A1:J44+A1:A1:J45","v":0},null,"MCD","MCD","% Change YOY","MCD","% Change YOY","MCD","% Change YOY","MCD"]
["Year ending:",null,2024,2023,null,2023,null,2022,null,2021]
["Stock Price ",null,137.77000000000001,134.9,{"$f":"IFERROR((C3-D3)/D3,\"Missing Info\")","v":2.1275018532246143E-2},134.9,{"$f":"IFERROR((F3-H3)/H3,\"Missing Info\")","v":4.8499922275765654E-2},128.66,{"$f":"IFERROR((H3-J3)/J3,\"Missing Info\")","v":-7.4388489208633113E-2},139]
["Revenue",null,{"$f":"_xlfn.XLOOKUP(A4,Table5[Statements],Table5[2024])","v":7549},{"$f":"_xlfn.XLOOKUP(A4,Table5[Statements],Table5[2023])","v":7076},{"$f":"IFERROR((C4-D4)/D4,\"Missing Info\")","v":6.6845675522894291E-2},{"$f":"D4","v":7076},{"$f":"IFERROR((F4-H4)/H4,\"Missing Info\")","v":3.4200526161940956E-2},{"$f":"_xlfn.XLOOKUP(A4,Table5[Statements],Table5[2022])","v":6842},{"$f":"IFERROR((H4-J4)/J4,\"Missing Info\")","v":3.9185905224787362E-2},{"$f":"_xlfn.XLOOKUP(A4,Table5[Statements],Table5[2021])","v":6584}]
["Cost of Revenue",null,{"$f":"_xlfn.XLOOKUP(A5,Table5[Statements],Table5[2024])","v":2120},{"$f":"_xlfn.XLOOKUP(A5,Table5[Statements],Table5[2023])","v":1774},{"$f":"IFERROR((C5-D5)/D5,\"Missing Info\")","v":0.19503945885005636},{"$f":"D5","v":1774},{"$f":"IFERROR((F5-H5)/H5,\"Missing Info\")","v":1.66189111747851E-2},{"$f":"_xlfn.XLOOKUP(A5,Table5[Statements],Table5[2022])","v":1745},{"$f":"IFERROR((H5-J5)/J5,\"Missing Info\")","v":1.1594202898550725E-2},{"$f":"_xlfn.XLOOKUP(A5,Table5[Statements],Table5[2021])","v":1725}]
["Gross Profit",null,{"$f":"_xlfn.XLOOKUP(A6,Table5[Statements],Table5[2024])","v":5429},{"$f":"_xlfn.XLOOKUP(A6,Table5[Statements],Table5[2023])","v":5302},2.3953225198038476E-2,5302,4.0219737100255053E-2,{"$f":"_xlfn.XLOOKUP(A6,Table5[Statements],Table5[2022])","v":5097},4.8981271866639225E-2,{"$f":"_xlfn.XLOOKUP(A6,Table5[Statements],Table5[2021])","v":4859}]
["SG&A Expenses",null,{"$f":"_xlfn.XLOOKUP(A7,Table5[Statements],Table5[2024])","v":2892},{"$f":"_xlfn.XLOOKUP(A7,Table5[Statements],Table5[2023])","v":2876},5.5632823365785811E-3,2876,2.458140363377271E-2,{"$f":"_xlfn.XLOOKUP(A7,Table5[Statements],Table5[2022])","v":2807},6.4871016691957509E-2,{"$f":"_xlfn.XLOOKUP(A7,Table5[Statements],Table5[2021])","v":2636}]
["Operating Income",null,{"$f":"_xlfn.XLOOKUP(A8,Table5[Statements],Table5[2024])","v":2403},{"$f":"_xlfn.XLOOKUP(A8,Table5[Statements],Table5[2023])","v":2318},3.6669542709232096E-2,2318,5.9899405578417927E-2,{"$f":"_xlfn.XLOOKUP(A8,Table5[Statements],Table5[2022])","v":2187},2.244039270687237E-2,{"$f":"_xlfn.XLOOKUP(A8,Table5[Statements],Table5[2021])","v":2139}]
["Net Income Common",null,{"$f":"_xlfn.XLOOKUP(A9,Table5[Statements],Table5[2024])","v":1486},{"$f":"_xlfn.XLOOKUP(A9,Table5[Statements],Table5[2023])","v":1597},-6.9505322479649342E-2,1597,0.20528301886792452,{"$f":"_xlfn.XLOOKUP(A9,Table5[Statements],Table5[2022])","v":1325},-0.15873015873015872,{"$f":"_xlfn.XLOOKUP(A9,Table5[Statements],Table5[2021])","v":1575}]
["Cash and Short Term Investments",null,{"$f":"_xlfn.XLOOKUP(A10,Table5[Statements],Table5[2024])","v":616},{"$f":"_xlfn.XLOOKUP(A10,Table5[Statements],Table5[2023])","v":512},0.203125,512,0.39509536784741145,{"$f":"_xlfn.XLOOKUP(A10,Table5[Statements],Table5[2022])","v":367},-0.2448559670781893,{"$f":"_xlfn.XLOOKUP(A10,Table5[Statements],Table5[2021])","v":486}]
{"$rows_left_out":35}
{"sheet":"Ratio Formulas","index":13,"n_rows":0,"n_cols":0,"rows_kept":0,"cut":false,"hidden":false,"merged":[]}

{"sheet":"TrendLineChart","index":14,"n_rows":30,"n_cols":7,"rows_kept":30,"cut":false,"hidden":false,"merged":[]}
[]
[null,"Revenue (SALES) YOY Trend Chart"]
[null,"Year","MCD","CAVA","CMG","SHAK","YUM"]
[null,2021,{"$f":"'YOY MCD'!$J4","v":23222.9},{"$f":"CAVA!E2","v":500.07},{"$f":"CMG!E2","v":7547.06},{"$f":"SHAK!E2","v":739.89},{"$f":"YUM!E2","v":6584}]
[null,2022,{"$f":"'YOY MCD'!$H4","v":23183},{"$f":"CAVA!D2","v":564.12},{"$f":"CMG!D2","v":8634.65},{"$f":"SHAK!D2","v":900.49},{"$f":"YUM!D2","v":6842}]
[null,2023,{"$f":"'YOY MCD'!D4","v":25494},{"$f":"CAVA!C2","v":728.7},{"$f":"CMG!C2","v":9871.65},{"$f":"SHAK!C2","v":1087.53},{"$f":"YUM!C2","v":7076}]
[null,2024,{"$f":"'YOY MCD'!C4","v":25920},{"$f":"CAVA!B2","v":963.71},{"$f":"CMG!B2","v":11313.85},{"$f":"SHAK!B2","v":1252.6099999999999},{"$f":"YUM!B2","v":7549}]
[]
[]
[null,"Profits YOY Trend Chart"]
{"$rows_left_out":20}